{"text_format":"1","workbook":"xlsx","n_sheets":14,"sheets":["SSHP Download","CHFA Download","5yr SSHP History","5yr CHFA History","Input","Cashflow","Amortization","Rent Roll","Prepay Calc","Cap Rate","Property Valuation","Module1","Notes","Sheet1"],"not_rendered":{"charts":0,"images":0,"macros":1,"external_links":1,"defined_names":33,"comments":6,"pivot_tables":0},"unopened":[{"sheet":"Module1","index":11,"reason":"part_missing"}],"bounds":{"document_bytes":16777216,"sheet_cells":100000,"rows_first":2000,"rows_last":500,"rows_between":2000,"halvings":0,"cell_chars":16384,"cell_head_chars":4096},"cells_cut":0,"cells_raw":0,"read":"whole","date_system":"1900"}

{"sheet":"SSHP Download","index":0,"n_rows":57,"n_cols":3,"rows_kept":57,"cut":false,"hidden":true,"merged":[[11,0,11,1],[0,0,0,1],[1,0,1,1],[2,0,2,1],[3,0,3,1],[4,0,4,1],[5,0,5,1],[6,0,6,1],[7,0,7,1],[8,0,8,1],[9,0,9,1],[10,0,10,1],[23,0,23,1],[12,0,12,1],[13,0,13,1],[14,0,14,1],[15,0,15,1],[16,0,16,1],[17,0,17,1],[18,0,18,1],[19,0,19,1],[20,0,20,1],[21,0,21,1],[22,0,22,1],[35,0,35,1],[24,0,24,1],[25,0,25,1],[26,0,26,1],[27,0,27,1],[28,0,28,1],[29,0,29,1],[30,0,30,1],[31,0,31,1],[32,0,32,1],[33,0,33,1],[34,0,34,1],[47,0,47,1],[36,0,36,1],[37,0,37,1],[38,0,38,1],[39,0,39,1],[40,0,40,1],[41,0,41,1],[42,0,42,1],[43,0,43,1],[44,0,44,1],[45,0,45,1],[46,0,46,1],[54,0,54,1],[55,0,55,1],[56,0,56,1],[48,0,48,1],[49,0,49,1],[50,0,50,1],[51,0,51,1],[52,0,52,1],[53,0,53,1]]}
["Rental Income - Tenant Payments",null,3100]
[" Rental Income - Excess of Base",null,3100.1]
[" Excess Utilities ",null,3110]
[" Surcharges ",null,3120]
[" Total Rental Income ",null,3199]
[" Less: Dwelling Vacancy ",null,3210]
[" Dwelling Vacancy Subsidy(Sec 8) ",null,3220]
[" Net Rental Income ",null,3299]
[" Non-Dwelling Rentals ",null,3300]
[" Sales & Services to Tenants ",null,3510]
[" Interest Income ",null,3610]
[" Other Income ",null,3620]
[" TOTAL EFFECTIVE GROSS INCOME ",null,3999]
[" Salaries-Office ",null,4120]
[" Compensated Absences - Adm Salaries ",null,4120.1000000000004]
{"$rows_left_out":43}
{"sheet":"CHFA Download","index":1,"n_rows":120,"n_cols":3,"rows_kept":120,"cut":false,"hidden":true,"merged":[[6,0,6,1],[7,0,7,1],[8,0,8,1],[9,0,9,1],[10,0,10,1],[11,0,11,1],[0,0,0,1],[1,0,1,1],[2,0,2,1],[3,0,3,1],[4,0,4,1],[5,0,5,1],[18,0,18,1],[19,0,19,1],[20,0,20,1],[21,0,21,1],[22,0,22,1],[23,0,23,1],[12,0,12,1],[13,0,13,1],[14,0,14,1],[15,0,15,1],[16,0,16,1],[17,0,17,1],[30,0,30,1],[31,0,31,1],[32,0,32,1],[33,0,33,1],[34,0,34,1],[35,0,35,1],[24,0,24,1],[25,0,25,1],[26,0,26,1],[27,0,27,1],[28,0,28,1],[29,0,29,1],[42,0,42,1],[43,0,43,1],[44,0,44,1],[45,0,45,1],[46,0,46,1],[47,0,47,1],[36,0,36,1],[37,0,37,1],[38,0,38,1],[39,0,39,1],[40,0,40,1],[41,0,41,1],[54,0,54,1],[55,0,55,1],[56,0,56,1],[57,0,57,1],[58,0,58,1],[59,0,59,1],[48,0,48,1],[49,0,49,1],[50,0,50,1],[51,0,51,1],[52,0,52,1],[53,0,53,1],[66,0,66,1],[67,0,67,1],[68,0,68,1],[69,0,69,1],[70,0,70,1],[71,0,71,1],[60,0,60,1],[61,0,61,1],[62,0,62,1],[63,0,63,1],[64,0,64,1],[65,0,65,1],[78,0,78,1],[79,0,79,1],[80,0,80,1],[81,0,81,1],[82,0,82,1],[83,0,83,1],[72,0,72,1],[73,0,73,1],[74,0,74,1],[75,0,75,1],[76,0,76,1],[77,0,77,1],[90,0,90,1],[91,0,91,1],[92,0,92,1],[93,0,93,1],[94,0,94,1],[95,0,95,1],[84,0,84,1],[85,0,85,1],[86,0,86,1],[87,0,87,1],[88,0,88,1],[89,0,89,1],[102,0,102,1],[103,0,103,1],[104,0,104,1],[105,0,105,1],[106,0,106,1],[107,0,107,1],[96,0,96,1],[97,0,97,1],[98,0,98,1],[99,0,99,1],[100,0,100,1],[101,0,101,1],[114,0,114,1],[115,0,115,1],[116,0,116,1],[117,0,117,1],[118,0,118,1],[119,0,119,1],[108,0,108,1],[109,0,109,1],[110,0,110,1],[111,0,111,1],[112,0,112,1],[113,0,113,1]]}
["Rent Revenue- Gross Potential",null,5120]
["Tenant Assistance Payments (HAP Receipts)",null,5121]
["Furniture and Equipment",null,5130]
["Rent Revenue- Stores & Commercial",null,5140]
["Rent Revenue- Garage & Parking",null,5170]
["Flexible Subsidy Revenue",null,5180]
["Miscellaneous Rent Revenue**",null,5190]
["Excess Rent",null,5191]
["Rent Revenue - Insurance",null,5192]
["Special Claims Revenue",null,5193]
["Retained Excess Income",null,5194]
["Total Rent Revenue (GPI @ 100% Occupancy)",null,5100]
["Apartments- Vacancy",null,5220]
["Furniture and Equipment",null,5230]
["Stores & Commercial- Vacancy",null,5240]
{"$rows_left_out":106}
{"sheet":"5yr SSHP History","index":2,"n_rows":64,"n_cols":18,"rows_kept":64,"cut":false,"hidden":false,"merged":[[53,0,53,1],[54,0,54,1],[55,0,55,1],[56,0,56,1],[61,0,61,1],[57,0,57,1],[58,0,58,1],[59,0,59,1],[60,0,60,1],[52,0,52,1],[41,0,41,1],[42,0,42,1],[43,0,43,1],[44,0,44,1],[45,0,45,1],[46,0,46,1],[47,0,47,1],[48,0,48,1],[49,0,49,1],[50,0,50,1],[51,0,51,1],[40,0,40,1],[29,0,29,1],[30,0,30,1],[31,0,31,1],[32,0,32,1],[33,0,33,1],[34,0,34,1],[35,0,35,1],[36,0,36,1],[37,0,37,1],[38,0,38,1],[39,0,39,1],[28,0,28,1],[17,0,17,1],[18,0,18,1],[19,0,19,1],[20,0,20,1],[21,0,21,1],[22,0,22,1],[23,0,23,1],[24,0,24,1],[25,0,25,1],[26,0,26,1],[27,0,27,1],[16,0,16,1],[5,0,5,1],[6,0,6,1],[7,0,7,1],[8,0,8,1],[9,0,9,1],[10,0,10,1],[11,0,11,1],[12,0,12,1],[13,0,13,1],[14,0,14,1],[15,0,15,1]]}
["5 Year Income & Expense Comparison "]
["Property:             "]
[null,null,null,null,"% ",null,"% ",null,"% ",null,"% ",null,null,null,"Current Approved Budget","Actual Annualized","Current Operating  # of months","Application Proforma"]
["Account Description",null,"Account #",2018,"Change",{"$f":"D4-1","v":2017},"Change",{"$f":"F4-1","v":2016},"Change",{"$f":"H4-1","v":2015},"Change",{"$f":"J4-1","v":2014},"Average",null,2019,2019,3]
[]
["Rental Income - Base Rent",null,3100,null,null,null,null,null,null,null,null,null,{"$f":"IF(SUM(L6+J6+H6+F6+D6)<>0,AVERAGE(L6,J6,H6,F6,D6),0)","v":0},null,0,{"$f":"IF(+Q6<>0,+(+Q6/$Q$4)*12,0)","v":0},0,0]
[" Rental Income - Excess of Base",null,3100.1,null,null,null,null,null,null,null,null,null,{"$f":"IF(SUM(L7+J7+H7+F7+D7)<>0,AVERAGE(L7,J7,H7,F7,D7),0)","v":0},null,0,{"$f":"IF(+Q7<>0,+(+Q7/$Q$4)*12,0)","v":0},0,0]
[" Excess Utilities ",null,3110,null,null,null,null,null,null,null,null,null,0,null,0,0,0,0]
[" Surcharges ",null,3120,null,null,null,null,null,null,null,null,null,0,null,0,0,0,0]
[" Total Rental Income ",null,3199,null,null,null,null,null,null,null,null,null,0,null,{"$f":"SUM(O6:O9)","v":0},0,{"$f":"SUM(Q6:Q9)","v":0},{"$f":"SUM(R6:R9)","v":0}]
[" Less: Dwelling Vacancy ",null,3210,null,null,null,null,null,null,null,null,null,0,null,0,0,0,0]
[" Dwelling Vacancy Subsidy(Sec 8) ",null,3220,null,null,null,null,null,null,null,null,null,0,null,0,0,0,0]
[" Net Rental Income ",null,3299,null,null,null,null,null,null,null,null,null,0,null,{"$f":"SUM(O11:O12)","v":0},0,{"$f":"SUM(Q11:Q12)","v":0},{"$f":"SUM(R11:R12)","v":0}]
[" Non-Dwelling Rentals ",null,3300,null,null,null,null,null,null,null,null,null,0,null,0,0,0,0]
[" Sales & Services to Tenants ",null,3510,null,null,null,null,null,null,null,null,null,0,null,0,0,0,0]
{"$rows_left_out":50}
{"sheet":"5yr CHFA History","index":3,"n_rows":128,"n_cols":18,"rows_kept":128,"cut":false,"hidden":true,"merged":[[92,0,92,1],[123,0,123,1],[124,0,124,1],[113,0,113,1],[114,0,114,1],[115,0,115,1],[116,0,116,1],[121,0,121,1],[122,0,122,1],[120,0,120,1],[119,0,119,1],[118,0,118,1],[109,0,109,1],[117,0,117,1],[107,0,107,1],[103,0,103,1],[104,0,104,1],[105,0,105,1],[108,0,108,1],[110,0,110,1],[111,0,111,1],[112,0,112,1],[93,0,93,1],[94,0,94,1],[96,0,96,1],[95,0,95,1],[97,0,97,1],[98,0,98,1],[99,0,99,1],[100,0,100,1],[101,0,101,1],[102,0,102,1],[106,0,106,1],[84,0,84,1],[85,0,85,1],[88,0,88,1],[89,0,89,1],[91,0,91,1],[86,0,86,1],[87,0,87,1],[90,0,90,1],[78,0,78,1],[79,0,79,1],[80,0,80,1],[81,0,81,1],[82,0,82,1],[83,0,83,1],[72,0,72,1],[73,0,73,1],[74,0,74,1],[75,0,75,1],[76,0,76,1],[77,0,77,1],[66,0,66,1],[67,0,67,1],[68,0,68,1],[69,0,69,1],[70,0,70,1],[71,0,71,1],[60,0,60,1],[61,0,61,1],[63,0,63,1],[64,0,64,1],[62,0,62,1],[65,0,65,1],[53,0,53,1],[54,0,54,1],[55,0,55,1],[57,0,57,1],[58,0,58,1],[59,0,59,1],[47,0,47,1],[48,0,48,1],[49,0,49,1],[50,0,50,1],[51,0,51,1],[52,0,52,1],[56,0,56,1],[41,0,41,1],[42,0,42,1],[43,0,43,1],[44,0,44,1],[45,0,45,1],[46,0,46,1],[33,0,33,1],[34,0,34,1],[35,0,35,1],[36,0,36,1],[39,0,39,1],[40,0,40,1],[37,0,37,1],[38,0,38,1],[26,0,26,1],[27,0,27,1],[28,0,28,1],[29,0,29,1],[31,0,31,1],[32,0,32,1],[30,0,30,1],[17,0,17,1],[18,0,18,1],[19,0,19,1],[20,0,20,1],[21,0,21,1],[22,0,22,1],[23,0,23,1],[24,0,24,1],[25,0,25,1],[11,0,11,1],[12,0,12,1],[13,0,13,1],[14,0,14,1],[15,0,15,1],[16,0,16,1],[5,0,5,1],[6,0,6,1],[7,0,7,1],[8,0,8,1],[9,0,9,1],[10,0,10,1]]}
["5 Year Income & Expense Comparison "]
["Property:             ",null,null,null,null,null,null,null,null,null,null,null,null,null,"Current Approved","Actual","Current Operating"]
[null,null,null,null,"% ",null,"% ",null,"% ",null,"% ",null,null,null,"Budget","Annualized","# Months","Proforma"]
["Account Description",null,"Account #",2016,"Change",{"$f":"D4-1","v":2015},"Change",{"$f":"F4-1","v":2014},"Change",{"$f":"H4-1","v":2013},"Change",{"$f":"J4-1","v":2012},"Average"]
[]
["Rent Revenue- Gross Potential",null,5120,null,null,null,null,null,null,null,null,null,{"$f":"IF(SUM(L6+J6+H6+F6+D6)<>0,AVERAGE(L6,J6,H6,F6,D6),0)","v":0},null,null,{"$f":"IF(Q6<>0,(+Q6/$Q$4)*12,0)","v":0},null,0]
["Tenant Assistance Payments (HAP Receipts)",null,5121,null,null,null,null,null,null,null,null,null,{"$f":"IF(SUM(L7+J7+H7+F7+D7)<>0,AVERAGE(L7,J7,H7,F7,D7),0)","v":0},null,null,{"$f":"IF(Q7<>0,(+Q7/$Q$4)*12,0)","v":0},null,0]
["Furniture and Equipment",null,5130,null,null,null,null,null,null,null,null,null,0,null,null,0,null,0]
["Rent Revenue- Stores & Commercial",null,5140,null,null,null,null,null,null,null,null,null,0,null,null,0,null,0]
["Rent Revenue- Garage & Parking",null,5170,null,null,null,null,null,null,null,null,null,0,null,null,0,null,0]
["Flexible Subsidy Revenue",null,5180,null,null,null,null,null,null,null,null,null,0,null,null,0,null,0]
["Miscellaneous Rent Revenue**",null,5190,null,null,null,null,null,null,null,null,null,0,null,null,0,null,0]
["Excess Rent",null,5191,null,null,null,null,null,null,null,null,null,0,null,null,0,null,0]
["Rent Revenue - Insurance",null,5192,null,null,null,null,null,null,null,null,null,0,null,null,0,null,0]
["Special Claims Revenue",null,5193,null,null,null,null,null,null,null,null,null,0,null,null,0,null,0]
{"$rows_left_out":114}
{"sheet":"Input","index":4,"n_rows":43,"n_cols":8,"rows_kept":43,"cut":false,"hidden":false,"merged":[[42,7,42,10],[11,7,11,13],[14,7,14,14],[15,7,15,16],[16,7,16,13],[17,7,17,13],[21,7,21,14],[32,7,32,15],[13,7,13,14],[40,7,40,10],[8,7,8,13],[3,7,3,14],[41,7,41,10],[0,1,0,4],[1,7,1,15],[4,7,4,14],[39,7,39,10],[24,7,24,14],[34,2,34,3],[12,7,12,12],[20,7,20,12],[27,7,27,12],[19,7,19,11],[22,7,22,12]]}
["Property",{"$f":"IF(Cashflow!C9=\"x\",+'5yr CHFA History'!B2,'5yr SSHP History'!B2)","v":0}]
["Units",null,null,null,0,null,null," Comments"]
["First Year ",null,null,null,"Proforma","Adjustment","First Year"]
["Gross Potential Rent Revenue (Tenant)",null,null,null,{"$f":"IF(Cashflow!C9=\"X\",'5yr CHFA History'!R6,'5yr SSHP History'!R7+'5yr SSHP History'!R6)","v":0},null,{"$f":"+E4+F4","v":0}]
["Gross Potential Rent Revenue (HAP)",null,null,null,{"$f":"IF(Cashflow!C9=\"x\",'5yr CHFA History'!R7,0)","v":0},null,0]
["Vacancy Rate",0.02,null,"Input",{"$f":"IF(Cashflow!C9=\"x\",'5yr CHFA History'!R24,'5yr SSHP History'!R11+'5yr SSHP History'!R12)","v":0},{"$f":"IF(-E6>(E4+E5)*B6,0,((E4+E5)*B6)+E6)*-1","v":0},{"$f":"+E6+F6","v":0}]
["Elderly & Congregate Services Income",null,null,null,{"$f":"IF(Cashflow!C9=\"x\",+'5yr CHFA History'!R26,0)","v":0},null,0]
["Financial Revenue",null,null,null,{"$f":"IF(Cashflow!C9=\"x\",+'5yr CHFA History'!R31,'5yr SSHP History'!R16)","v":0},null,0]
["Other Revenue",null,null,null,{"$f":"IF(Cashflow!C9=\"x\",'5yr CHFA History'!R8+'5yr CHFA History'!R9+'5yr CHFA History'!R10+'5yr CHFA History'!R11+'5yr CHFA History'!R12+'5yr CHFA History'!R13+'5yr CHFA History'!R14+'5yr CHFA History'!R15+'5yr CHFA History'!R16+'5yr CHFA History'!R38,'5yr SSHP History'!R9+'5yr SSHP History'!R8+'5yr SSHP History'!R14+'5yr SSHP History'!R15+'5yr SSHP History'!R17+'5yr SSHP History'!R59)","v":0},null,0]
["Effective Income",null,null,null,{"$f":"SUM(E4:E9)","v":0},{"$f":"SUM(F4:F9)","v":0},{"$f":"SUM(G4:G9)","v":0}]
[]
["Administrative",null,null,null,{"$f":"IF(Cashflow!C9=\"x\",'5yr CHFA History'!R57-'5yr CHFA History'!R48,'5yr SSHP History'!R32-'5yr SSHP History'!R25-'5yr SSHP History'!R30-'5yr SSHP History'!R31+'5yr SSHP History'!R55)","v":0},null,{"$f":"+E12+F12","v":0}]
["Management Fees/ %/yr",0.05,{"$f":"+E10*B13","v":0},null,{"$f":"IF(Cashflow!C9=\"x\",+'5yr CHFA History'!R48,'5yr SSHP History'!R25)","v":0},null,{"$f":"+E13+F13","v":0}]
["Utilities",null,null,null,{"$f":"IF(Cashflow!C9=\"X\",'5yr CHFA History'!R63,'5yr SSHP History'!R39-'5yr SSHP History'!R37)","v":0},null,0]
["Operating & Maintenance ",null,null,null,{"$f":"IF(Cashflow!C9=\"x\",'5yr CHFA History'!R87,'5yr SSHP History'!R45+'5yr SSHP History'!R46+'5yr SSHP History'!R60+'5yr SSHP History'!R37)","v":0},null,0]
{"$rows_left_out":29}
{"sheet":"Cashflow","index":5,"n_rows":50,"n_cols":46,"rows_kept":50,"cut":false,"hidden":false,"merged":[[46,12,46,15],[7,7,7,11],[6,16,7,16],[6,17,7,17],[7,12,7,13],[44,12,44,13],[43,12,43,13],[40,12,40,15],[6,14,6,15]]}
[1,"Assumptions:",null,null,null,null,null,null,null,{"$f":"+Input!B1","v":0}]
[{"$f":"A1+1","v":2},"Number of Units",null,null,null,null,null,{"$f":"Input!E2","v":0}]
[3,"Tenant's Rent Inflation",null,null,null,null,null,0.02]
[4,"Growth Rate in HAP",null,null,null,null,null,0.02]
[5,"Expense Inflation",null,null,null,null,null,0.03]
[6,"Replacement Reserves Inflation",null,null,null,null,null,0]
[7,null,null,null,null,null,null,null,null,null,null,null,null,null,"BORROWER'S CURRENT",null,"First Year"]
[8,null,null,null,null,null,null,"DOWNLOADED HISTORIC STATEMENTS",null,null,null,null,"Historical",null,"Budget","Annualized*"]
[9,null,null,"Private",null,"X","Public",null,null,null,null,null,null,"Annual",null,null,1,{"$f":"1+Q9","v":2},3,4,5,6,7,8,{"$f":"1+X9","v":9},10,11,12,13,14,15,16,17,{"$f":"1+AG9","v":18},19,20,21,22,23,24,25,26,27,28,29,30]
[10,null,null,null,null," ",null,{"$f":"IF($C9=\"X\",'5yr CHFA History'!L4,'5yr SSHP History'!L4)","v":2014},{"$f":"IF($C9=\"X\",'5yr CHFA History'!J4,'5yr SSHP History'!J4)","v":2015},{"$f":"IF($C9=\"X\",'5yr CHFA History'!H4,'5yr SSHP History'!H4)","v":2016},{"$f":"IF($C9=\"X\",'5yr CHFA History'!F4,'5yr SSHP History'!F4)","v":2017},{"$f":"IF($C9=\"X\",'5yr CHFA History'!D4,'5yr SSHP History'!D4)","v":2018},"Average","Growth %",{"$f":"+'5yr SSHP History'!O4","v":2019},{"$f":"+'5yr SSHP History'!P4","v":2019},{"$f":"+Input!B3","v":0},{"$f":"+Q10+1","v":1},{"$f":"+R10+1","v":2},3,4,5,6,7,{"$f":"+X10+1","v":8},9,10,11,12,13,14,15,16,{"$f":"+AG10+1","v":17},18,19,20,21,22,23,24,25,26,27,28,29]
[11,"SOURCES"]
[12,"Gross Potential Rent Revenue (Tenant)",null,null,null,null,null,{"$f":"IF($C9=\"X\",'5yr CHFA History'!L6,'5yr SSHP History'!L6+'5yr SSHP History'!L7)","v":0},{"$f":"IF($C9=\"X\",'5yr CHFA History'!J6,'5yr SSHP History'!J6+'5yr SSHP History'!J7)","v":0},{"$f":"IF($C9=\"X\",'5yr CHFA History'!H6,'5yr SSHP History'!H6+'5yr SSHP History'!H7)","v":0},{"$f":"IF($C9=\"X\",'5yr CHFA History'!F6,'5yr SSHP History'!F6+'5yr SSHP History'!F7)","v":0},{"$f":"IF($C9=\"X\",'5yr CHFA History'!D6,'5yr SSHP History'!D7+'5yr SSHP History'!D6)","v":0},{"$f":"IF(SUM(H12:L12)<>0,SUM(H12:L12)/(SUMPRODUCT((H12:L12<>0)*1)),0)","v":0},{"$f":"IF(M12=0,0,(L12/H12)^0.2-1)","v":0},{"$f":"IF($C9=\"X\",'5yr CHFA History'!O6,'5yr SSHP History'!O7+'5yr SSHP History'!O6)","v":0},{"$f":"IF($C9=\"X\",'5yr CHFA History'!P6,'5yr SSHP History'!P7+'5yr SSHP History'!P6)","v":0},{"$f":"+Input!G4","v":0},{"$f":"Q12*(1+$H$3)","v":0},{"$f":"R12*(1+$H$3)","v":0},{"$f":"S12*(1+$H$3)","v":0},0,0,0,0,0,0,0,0,0,0,0,0,0,0,0,0,0,0,0,0,0,0,0,0,0,0]
[13,"Gross Potential Rent Revenue (HAP)",null,null,null,null,null,{"$f":"IF($C9=\"x\",'5yr CHFA History'!L7,0)","v":0},{"$f":"IF($C9=\"x\",'5yr CHFA History'!J7,0)","v":0},{"$f":"IF($C9=\"x\",'5yr CHFA History'!H7,0)","v":0},{"$f":"IF($C9=\"x\",'5yr CHFA History'!F7,0)","v":0},{"$f":"IF($C9=\"x\",'5yr CHFA History'!D7,0)","v":0},{"$f":"IF(SUM(H13:L13)<>0,SUM(H13:L13)/(SUMPRODUCT((H13:L13<>0)*1)),0)","v":0},{"$f":"IF(M13=0,0,(L13/H13)^0.2-1)","v":0},{"$f":"IF($C9=\"x\",'5yr CHFA History'!O7,0)","v":0},{"$f":"IF($C9=\"x\",'5yr CHFA History'!P7,0)","v":0},{"$f":"+Input!G5","v":0},{"$f":"Q13*(1+$H$4)","v":0},{"$f":"R13*(1+$H$4)","v":0},{"$f":"S13*(1+$H$4)","v":0},0,0,0,0,0,0,0,0,0,0,0,0,0,0,0,0,0,0,0,0,0,0,0,0,0,0]
[14,"Total Gross Potential",null,null,null,null,null,{"$f":"H12+H13","v":0},0,0,0,0,0,0,{"$f":"O12+O13","v":0},{"$f":"P12+P13","v":0},{"$f":"SUM(Q12:Q13)","v":0},{"$f":"SUM(R12:R13)","v":0},{"$f":"SUM(S12:S13)","v":0},{"$f":"SUM(T12:T13)","v":0},0,0,0,0,0,0,0,0,0,0,0,0,0,0,0,0,0,0,0,0,0,0,0,0,0,0]
[15,"Vacancies",null,null,null,null,null,{"$f":"IF($C9=\"x\",'5yr CHFA History'!L24,'5yr SSHP History'!L11+'5yr SSHP History'!L12)","v":0},{"$f":"IF($C9=\"x\",'5yr CHFA History'!J24,'5yr SSHP History'!J11+'5yr SSHP History'!J12)","v":0},{"$f":"IF($C9=\"x\",'5yr CHFA History'!H24,'5yr SSHP History'!H11+'5yr SSHP History'!H12)","v":0},{"$f":"IF($C9=\"x\",'5yr CHFA History'!F24,'5yr SSHP History'!F11+'5yr SSHP History'!F12)","v":0},{"$f":"IF($C9=\"x\",'5yr CHFA History'!D24,'5yr SSHP History'!D11+'5yr SSHP History'!D12)","v":0},0,0,{"$f":"IF($C9=\"x\",'5yr CHFA History'!O24,'5yr SSHP History'!O11+'5yr SSHP History'!O12)","v":0},{"$f":"IF($C9=\"x\",'5yr CHFA History'!P24,'5yr SSHP History'!P11+'5yr SSHP History'!P12)","v":0},{"$f":"+Input!G6","v":0},{"$f":"Q15*(1+$H$5)","v":0},{"$f":"R15*(1+$H$5)","v":0},0,0,0,0,0,0,0,0,0,0,0,0,0,0,0,0,0,0,0,0,0,0,0,0,0,0,0]
{"$rows_left_out":36}
{"sheet":"Amortization","index":6,"n_rows":46,"n_cols":9,"rows_kept":46,"cut":false,"hidden":false,"merged":[]}
[]
[]
[]
["Amortization Schedule"]
[]
["Loan Amount:",null,{"$f":"Input!B29","v":0}]
["Term:",null,{"$f":"Input!E31","v":0.01},"Years"]
["Index Rate:",null,{"$f":"Input!C33","v":0}]
["Spread (includes 20 bp of servicing):",null,{"$f":"Input!D33","v":0}]
["Interest Rate:",null,{"$f":"C8+C9","v":0}]
["Servicing fee",null,0]
["Debt Constant:",null,{"$f":"PMT(C10,C7,-1,0)","v":100}]
["Annual Payment:",null,{"$f":"C6*C12","v":0}]
[]
[null,"Beginning","Debt",null,null,null,"Total","Ending"]
{"$rows_left_out":32}
{"sheet":"Rent Roll","index":7,"n_rows":63,"n_cols":9,"rows_kept":63,"cut":false,"hidden":true,"merged":[]}
[null,null,null,null,null,2011]
[null,"Rent",null,"Current","Rent ","New","% "]
["Br Size","at 50% AMI","No Units","Rent","Increase","Base Rent","Change","Months","GPR"]
[1,null,null,null,null,{"$f":"D4+E4","v":0},{"$f":"E4/D4","v":{"$error":"#DIV/0!"}},12,{"$f":"C4*F4*H4","v":0}]
[2,null,null,null,0,{"$f":"D5+E5","v":0},{"$error":"#DIV/0!"},12,{"$f":"C5*F5*H5","v":0}]
[3,null,null,null,0,{"$f":"D6+E6","v":0},{"$error":"#DIV/0!"},12,{"$f":"C6*F6*H6","v":0}]
[null,null,null,null,null,null,{"$error":"#DIV/0!"},null,0]
[null,null,null,null,null,null,{"$error":"#DIV/0!"},null,0]
[null,null,null,null,null,null,{"$error":"#DIV/0!"},null,0]
[]
[null,null,null,null,null,null,null,null,{"$f":"SUM(I4:I9)","v":0}]
[null,null,null,null,null,null,null,null,{"$f":"I11/12/28","v":0}]
[null,null,null,null,null,2012]
[null,"Rent*",null,"Current","Rent ","New","% "]
["Br Size","at 50% AMI","No Units","Rent","Increase","Base Rent","Change","Months","GPR"]
{"$rows_left_out":49}
{"sheet":"Prepay Calc","index":8,"n_rows":54,"n_cols":12,"rows_kept":54,"cut":false,"hidden":true,"merged":[[14,7,14,8]]}
["Name:",{"$f":"IF(+Input!B1=0,\"\",+Input!B1)","v":""}]
["Start Date"]
["Maturity date"]
["Remaining Term to Maturity (in months)",null,null,null,null,null,{"$f":"DAYS360(G2,G3)/360*12","v":0}]
["Balance Prepaid",null,null,null,null,null,{"$f":"IF(G6=0,0,PV(G6/12,G4,-G9))","v":0}]
["INTEREST RATE "]
["ORIGINAL TERM"]
["PAYMENTS PER YEAR",null,null,null,null,null,12]
["CURRENT P&I"]
["REINVESTMENT RATE",null,null,null,null,null,0.04]
["STIFF RATE",null,null,null,null,null,2.0999999999999999E-3]
[null,null,null,null,null,"TEST CALC",{"$f":"PMT(G6/12,G4,-G5)","v":{"$error":"#NUM!"}}]
[]
[]
[null,null,null,null,null,null,null," Interest Income",null,null,null,"PV OF"]
{"$rows_left_out":40}
{"sheet":"Cap Rate","index":9,"n_rows":18,"n_cols":7,"rows_kept":18,"cut":false,"hidden":true,"merged":[]}
[]
[]
[]
[null,"Determining an implied Cap Rate for Valuation calculated within the model."]
[]
[null,null,null,"Return on Equity","Mortage "]
[null,null,"CHFA Internal","Allowed by","Constant"]
[null,null,"Policy LTV","Regulatory","Used for Debt","Cap"]
[null,null,"(Underwriting)","Agreement","Service","Rate"]
[null,"Debt (LOAN)",0.8,null,{"$f":"+Amortization!C12","v":100},{"$f":"C10*E10","v":80}]
[null,"Equity",{"$f":"1-C10","v":0.19999999999999996},0.1,null,{"$f":"C11*D11","v":1.9999999999999997E-2}]
[null,"Total",{"$f":"C10+C11","v":1},null,null,{"$f":"F10+F11","v":80.02}]
[null,"Stabilized "]
[null,"NOI",null,null,null,{"$f":"+Cashflow!R34","v":0}]
[null,"Estimated Value",null,null,null,{"$f":"F14/F12","v":0}]
{"$rows_left_out":4}
{"sheet":"Property Valuation","index":10,"n_rows":36,"n_cols":8,"rows_kept":36,"cut":false,"hidden":true,"merged":[]}
[]
[null,null,"DESK TOP VALUATION OF PROPERTY"]
[null,null,"CHFA's cost of capital Index",null,0.04]
[null,null,"Property default spread*****",null,1.4999999999999999E-2]
[null,null,"Total Discount rate applied to cash flows",null,{"$f":"E3+E4","v":5.5E-2}]
[null,null,null,null,null,null,"PV of","Col C * Col F"]
[null,null,null,null,null,null,"The ","PV of "]
[null,0,"NOI****","TerminaL Value**",null,"PVIF","Terminal Value","NOI's"]
[null,1,{"$f":"Cashflow!Q34","v":0},null,null,{"$f":"1/(1+$E$5)^B9","v":0.94786729857819907},null,{"$f":"C9*F9","v":0}]
[null,{"$f":"B9+1","v":2},{"$f":"Cashflow!R$34","v":0},null,null,{"$f":"1/(1+$E$5)^B10","v":0.89845241571393286},null,{"$f":"C10*F10","v":0}]
[null,{"$f":"B10+1","v":3},{"$f":"Cashflow!S34","v":0},null,null,0.85161366418382267,null,0]
[null,4,{"$f":"Cashflow!T34","v":0},null,null,0.80721674330220161,null,0]
[null,5,{"$f":"Cashflow!U34","v":0},null,null,0.76513435384094941,null,0]
[null,6,{"$f":"Cashflow!V34","v":0},null,null,0.72524583302459655,null,0]
[null,7,{"$f":"Cashflow!W34","v":0},null,null,0.68743680855412004,null,0]
{"$rows_left_out":22}
{"sheet":"Notes","index":12,"n_rows":26,"n_cols":3,"rows_kept":26,"cut":false,"hidden":false,"merged":[[17,1,17,7]]}
["Summary Master"]
[null,"Input numbers into the yellow areas, the blue areas will adjust accordingly."]
[]
["Capital Needs"]
[null," Input manually."]
[]
["Summary Back-up"]
[null,"All formulas.  Print to see % change scenarios"]
[]
["Current RR"]
[null,"Input tenant information in columns 1,2,4,7"]
[null,"Columns S & U can be used to calculate mid year rent increases. "]
[null,null,"(mgt plan will need to be adapted.)"]
["Working RR"]
[null,"Formulas"]
{"$rows_left_out":12}
{"sheet":"Sheet1","index":13,"n_rows":0,"n_cols":0,"rows_kept":0,"cut":false,"hidden":false,"merged":[]}