{"text_format":"1","workbook":"xlsx","n_sheets":6,"sheets":["Financial Input Sheet","Stmt of Operations--HM 6-50","Surplus Cash--HM 6-51A","Adjusted Cash Flow--HM 6-51B","Computation of NOI--HM 6-52","DOH Congregate"],"not_rendered":{"charts":0,"images":0,"macros":1,"external_links":0,"defined_names":6,"comments":1,"pivot_tables":0},"unopened":[],"bounds":{"document_bytes":16777216,"sheet_cells":100000,"rows_first":2000,"rows_last":500,"rows_between":2000,"halvings":0,"cell_chars":16384,"cell_head_chars":4096},"cells_cut":0,"cells_raw":0,"read":"whole","date_system":"1900"}

{"sheet":"Financial Input Sheet","index":0,"n_rows":477,"n_cols":12,"rows_kept":477,"cut":false,"hidden":false,"merged":[[278,3,278,4],[416,6,416,8],[434,2,434,3],[434,6,434,8],[282,7,282,8],[283,7,283,8],[316,3,316,4],[317,3,317,4],[281,3,281,4],[294,3,294,4],[287,3,287,4],[289,3,289,4],[300,3,300,4],[301,3,301,4],[303,3,303,4],[304,3,304,4],[288,3,288,4],[299,3,299,4],[295,3,295,4],[290,3,290,4],[328,3,328,4],[336,3,336,4],[318,3,318,4],[339,1,339,6],[298,3,298,4],[279,3,279,4],[285,3,285,4],[280,3,280,4],[282,3,282,4],[283,3,283,4],[291,3,291,4],[292,3,292,4],[293,3,293,4],[329,3,329,4],[330,3,330,4],[325,3,325,4],[327,3,327,4],[302,3,302,4],[284,7,284,8],[285,7,285,8],[286,7,286,8],[287,7,287,8],[288,7,288,8],[289,7,289,8],[290,7,290,8],[291,7,291,8],[292,7,292,8],[284,3,284,4],[321,3,321,4],[322,3,322,4],[323,3,323,4],[320,7,320,8],[315,3,315,4],[315,7,315,8],[314,3,314,4],[286,3,286,4],[297,3,297,4],[313,3,313,4],[294,7,294,8],[415,9,415,13],[76,7,76,8],[77,7,77,8],[80,7,80,8],[81,7,81,8],[82,7,82,8],[329,7,329,8],[330,7,330,8],[331,7,331,8],[321,7,321,8],[322,7,322,8],[325,7,325,8],[326,7,326,8],[327,7,327,8],[328,7,328,8],[310,7,310,8],[276,7,276,8],[277,7,277,8],[313,7,313,8],[311,0,311,7],[314,7,314,8],[316,7,316,8],[317,7,317,8],[318,7,318,8],[449,7,449,8],[439,6,439,8],[415,6,415,8],[417,6,417,8],[418,6,418,8],[419,6,419,8],[420,6,420,8],[390,0,390,7],[427,6,427,8],[409,6,409,8],[410,6,410,8],[411,6,411,8],[409,1,409,3],[410,1,410,3],[411,1,411,3],[423,6,423,8],[426,6,426,8],[428,6,428,8],[430,6,430,8],[380,7,380,8],[373,7,373,8],[374,7,374,8],[379,3,379,4],[377,7,377,8],[378,7,378,8],[379,7,379,8],[377,3,377,4],[429,6,429,8],[421,6,421,8],[399,2,399,3],[397,2,397,3],[399,5,399,7],[384,7,384,8],[385,7,385,8],[386,7,386,8],[395,2,395,3],[386,3,386,4],[387,1,387,6],[388,1,388,6],[389,1,389,6],[381,7,381,8],[382,7,382,8],[383,3,383,4],[382,3,382,4],[391,5,391,7],[392,5,392,7],[476,7,476,8],[474,7,474,8],[470,7,470,8],[433,6,433,8],[435,6,435,8],[436,6,436,8],[437,6,437,8],[438,6,438,8],[383,7,383,8],[403,6,403,8],[404,6,404,8],[405,6,405,8],[406,6,406,8],[457,7,457,8],[455,7,455,8],[453,7,453,8],[451,7,451,8],[471,7,471,8],[467,7,467,8],[461,7,461,8],[462,7,462,8],[463,7,463,8],[464,7,464,8],[422,6,422,8],[362,7,362,8],[381,3,381,4],[375,3,375,4],[366,3,366,4],[367,3,367,4],[373,3,373,4],[374,3,374,4],[366,7,366,8],[367,7,367,8],[368,7,368,8],[363,3,363,4],[364,3,364,4],[370,3,370,4],[363,7,363,8],[364,7,364,8],[365,7,365,8],[368,3,368,4],[365,3,365,4],[378,3,378,4],[376,3,376,4],[380,3,380,4],[369,3,369,4],[375,7,375,8],[376,7,376,8],[334,7,334,8],[332,3,332,4],[356,7,356,8],[357,7,357,8],[358,7,358,8],[359,7,359,8],[360,7,360,8],[361,7,361,8],[361,3,361,4],[336,7,336,8],[350,7,350,8],[335,3,335,4],[333,3,333,4],[334,3,334,4],[353,7,353,8],[360,3,360,4],[332,7,332,8],[335,7,335,8],[369,7,369,8],[370,7,370,8],[371,7,371,8],[372,7,372,8],[319,3,319,4],[320,3,320,4],[337,1,337,6],[338,1,338,6],[362,3,362,4],[352,3,352,4],[355,3,355,4],[355,7,355,8],[353,3,353,4],[354,3,354,4],[354,7,354,8],[351,7,351,8],[352,7,352,8],[323,7,323,8],[324,7,324,8],[357,3,357,4],[358,3,358,4],[359,3,359,4],[319,7,319,8],[333,7,333,8],[273,7,273,8],[274,7,274,8],[275,7,275,8],[310,3,310,4],[295,7,295,8],[296,7,296,8],[297,7,297,8],[298,7,298,8],[299,7,299,8],[300,7,300,8],[301,7,301,8],[302,7,302,8],[303,7,303,8],[304,7,304,8],[305,7,305,8],[309,3,309,4],[306,3,306,4],[306,7,306,8],[309,7,309,8],[307,7,307,8],[308,7,308,8],[293,7,293,8],[305,3,305,4],[296,3,296,4],[279,7,279,8],[278,7,278,8],[280,7,280,8],[281,7,281,8],[242,7,242,8],[243,7,243,8],[237,7,237,8],[250,7,250,8],[239,7,239,8],[240,7,240,8],[247,7,247,8],[248,7,248,8],[249,7,249,8],[262,7,262,8],[263,7,263,8],[264,7,264,8],[265,7,265,8],[266,7,266,8],[267,7,267,8],[268,7,268,8],[269,7,269,8],[270,7,270,8],[271,7,271,8],[272,7,272,8],[230,7,230,8],[231,7,231,8],[232,7,232,8],[233,7,233,8],[234,7,234,8],[235,7,235,8],[236,7,236,8],[238,7,238,8],[241,7,241,8],[221,7,221,8],[222,7,222,8],[223,7,223,8],[224,7,224,8],[225,7,225,8],[226,7,226,8],[227,7,227,8],[228,7,228,8],[229,7,229,8],[215,7,215,8],[216,7,216,8],[217,7,217,8],[218,7,218,8],[219,7,219,8],[220,7,220,8],[209,7,209,8],[210,7,210,8],[211,7,211,8],[212,7,212,8],[277,3,277,4],[236,3,236,4],[219,3,219,4],[215,3,215,4],[225,3,225,4],[226,3,226,4],[227,3,227,4],[228,3,228,4],[229,3,229,4],[220,3,220,4],[221,3,221,4],[222,3,222,4],[223,3,223,4],[224,3,224,4],[230,3,230,4],[265,3,265,4],[263,3,263,4],[238,3,238,4],[241,3,241,4],[257,3,257,4],[216,3,216,4],[217,3,217,4],[218,3,218,4],[258,3,258,4],[214,3,214,4],[143,3,143,4],[147,3,147,4],[151,3,151,4],[152,3,152,4],[157,3,157,4],[173,3,173,4],[163,3,163,4],[184,1,184,6],[185,1,185,6],[148,0,148,7],[170,3,170,4],[171,3,171,4],[172,3,172,4],[182,3,182,4],[186,0,186,7],[206,7,206,8],[207,7,207,8],[169,3,169,4],[208,7,208,8],[213,7,213,8],[205,7,205,8],[214,7,214,8],[191,5,191,7],[123,3,123,4],[175,3,175,4],[176,3,176,4],[178,3,178,4],[183,3,183,4],[140,3,140,4],[70,7,70,8],[71,7,71,8],[72,7,72,8],[73,7,73,8],[119,3,119,4],[120,3,120,4],[121,3,121,4],[94,3,94,4],[104,3,104,4],[111,3,111,4],[113,3,113,4],[114,3,114,4],[115,3,115,4],[106,3,106,4],[107,3,107,4],[108,3,108,4],[109,3,109,4],[110,3,110,4],[212,3,212,4],[213,3,213,4],[207,3,207,4],[208,3,208,4],[209,3,209,4],[206,3,206,4],[210,3,210,4],[211,3,211,4],[204,7,204,8],[48,7,48,8],[63,7,63,8],[64,7,64,8],[191,2,191,3],[204,3,204,4],[84,0,84,7],[154,3,154,4],[168,3,168,4],[138,3,138,4],[155,3,155,4],[130,3,130,4],[203,3,203,4],[118,3,118,4],[126,3,126,4],[127,3,127,4],[135,3,135,4],[195,2,195,3],[193,2,193,3],[195,5,195,7],[193,5,193,7],[96,3,96,4],[98,3,98,4],[97,3,97,4],[122,3,122,4],[57,3,57,4],[53,3,53,4],[54,3,54,4],[68,3,68,4],[79,3,79,4],[87,3,87,4],[91,3,91,4],[73,3,73,4],[62,3,62,4],[21,7,21,8],[133,3,133,4],[139,3,139,4],[153,3,153,4],[136,3,136,4],[137,3,137,4],[128,3,128,4],[124,3,124,4],[131,3,131,4],[132,3,132,4],[74,7,74,8],[75,7,75,8],[78,7,78,8],[79,7,79,8],[83,7,83,8],[66,7,66,8],[67,7,67,8],[68,7,68,8],[69,7,69,8],[134,3,134,4],[117,3,117,4],[44,7,44,8],[45,7,45,8],[56,3,56,4],[0,5,0,7],[1,5,1,7],[83,3,83,4],[66,3,66,4],[67,3,67,4],[76,3,76,4],[69,3,69,4],[77,3,77,4],[78,3,78,4],[13,7,13,8],[37,7,37,8],[38,7,38,8],[40,7,40,8],[41,7,41,8],[42,7,42,8],[43,7,43,8],[22,7,22,8],[14,7,14,8],[15,7,15,8],[16,7,16,8],[17,7,17,8],[18,7,18,8],[19,7,19,8],[20,7,20,8],[15,3,15,4],[17,3,17,4],[187,5,187,7],[188,5,188,7],[16,3,16,4],[72,3,72,4],[112,3,112,4],[158,3,158,4],[160,3,160,4],[156,3,156,4],[164,3,164,4],[165,3,165,4],[166,3,166,4],[162,3,162,4],[49,7,49,8],[50,7,50,8],[52,7,52,8],[57,7,57,8],[58,7,58,8],[59,7,59,8],[60,7,60,8],[61,7,61,8],[65,7,65,8],[27,7,27,8],[55,7,55,8],[62,7,62,8],[174,3,174,4],[8,2,8,3],[159,3,159,4],[161,3,161,4],[6,2,6,3],[4,2,4,3],[8,5,8,7],[116,3,116,4],[95,3,95,4],[51,7,51,8],[53,7,53,8],[54,7,54,8],[56,7,56,8],[47,3,47,4],[64,3,64,4],[65,3,65,4],[60,3,60,4],[63,3,63,4],[51,3,51,4],[52,3,52,4],[61,3,61,4],[11,2,11,3],[14,3,14,4],[259,3,259,4],[249,3,249,4],[253,3,253,4],[248,3,248,4],[245,0,245,7],[244,7,244,8],[260,3,260,4],[261,3,261,4],[251,7,251,8],[252,7,252,8],[253,7,253,8],[254,7,254,8],[255,7,255,8],[256,7,256,8],[257,7,257,8],[258,7,258,8],[259,7,259,8],[260,7,260,8],[261,7,261,8],[250,3,250,4],[251,3,251,4],[252,3,252,4],[256,3,256,4],[268,3,268,4],[274,3,274,4],[231,3,231,4],[255,3,255,4],[262,3,262,4],[242,3,242,4],[269,3,269,4],[270,3,270,4],[271,3,271,4],[272,3,272,4],[273,3,273,4],[232,3,232,4],[237,3,237,4],[243,3,243,4],[244,3,244,4],[247,3,247,4],[264,3,264,4],[266,3,266,4],[267,3,267,4],[254,3,254,4],[233,3,233,4],[234,3,234,4],[18,3,18,4],[26,3,26,4],[30,3,30,4],[40,3,40,4],[34,3,34,4],[43,3,43,4],[35,3,35,4],[36,3,36,4],[37,3,37,4],[38,3,38,4],[19,3,19,4],[20,3,20,4],[21,3,21,4],[22,3,22,4],[32,3,32,4],[31,3,31,4],[23,3,23,4],[24,3,24,4],[34,7,34,8],[35,7,35,8],[36,7,36,8],[25,7,25,8],[26,7,26,8],[33,7,33,8],[28,7,28,8],[29,7,29,8],[30,7,30,8],[46,7,46,8],[47,7,47,8],[39,7,39,8],[31,7,31,8],[32,7,32,8],[12,3,12,4],[100,3,100,4],[102,3,102,4],[103,3,103,4],[101,3,101,4],[13,3,13,4],[99,3,99,4],[46,3,46,4],[74,3,74,4],[75,3,75,4],[48,3,48,4],[49,3,49,4],[50,3,50,4],[85,7,86,7],[23,7,23,8],[24,7,24,8],[44,3,44,4],[45,3,45,4],[42,3,42,4],[397,5,397,7],[395,5,395,7],[88,3,88,4],[89,3,89,4],[90,3,90,4],[92,3,92,4],[93,3,93,4],[129,3,129,4],[150,3,150,4],[167,3,167,4],[275,3,275,4],[349,3,349,4],[384,3,384,4],[385,3,385,4],[371,3,371,4],[372,3,372,4],[356,3,356,4],[350,3,350,4],[351,3,351,4],[235,3,235,4],[331,3,331,4],[324,3,324,4],[326,3,326,4],[276,3,276,4],[476,1,476,4],[461,1,461,4],[462,1,462,4],[449,1,449,4],[419,2,419,3],[420,2,420,3],[418,2,418,3],[406,2,406,3],[415,2,415,3],[417,2,417,3],[415,1,418,1],[419,1,423,1],[435,1,437,1],[439,2,439,3],[436,2,436,3],[455,1,455,4],[457,1,457,4],[433,2,433,3],[435,2,435,3],[474,1,474,4],[470,1,470,4],[471,1,471,4],[451,1,451,4],[453,1,453,4],[2,1,2,4],[469,1,469,4],[437,2,437,3],[438,2,438,3],[421,2,421,3],[422,2,422,3],[423,2,423,3],[463,1,463,4],[464,1,464,4],[403,2,403,3],[404,2,404,3],[405,2,405,3],[467,1,467,4],[426,2,426,3],[427,2,427,3],[428,2,428,3],[429,2,429,3],[426,1,427,1],[430,2,430,3],[416,2,416,3],[105,3,105,4],[41,3,41,4],[25,3,25,4],[33,3,33,4]]}
[null,"BALANCE SHEET INPUT SECTION",null,null,null,"Connecticut Housing Finance Authority",null,null,null,null,null,"CHANGES"]
[null,null,null,null,null,"Asset Management - Multifamily Housing"]
[null,"Note:  Insertions, revisions and/or updates have been highlighted in yellow and/or appear in red lettering.  See Changes Column.",null,null,null,null,null,"Rev. 12/2022 -- Effective FYE 12/31/2022",null,null,null,"Updated Rev. and FYE dates"]
[null,null,null,null,null,null,null,null,null,"Yes"]
[null,"Project Name:",null,null,"Fiscal Year-End:",null,null,null,null,"No",null,"Updated format of date appearance (e.g. December 31, 2022)"]
[]
[null,"CHFA Number:",null,null,"Beginning Date:",null,"Number of Units:"]
[null,null,null,null,null,null,null,null,null,"Yes"]
[null,"HUD Number:",null,null,"Mortgagor:",null,null,null,null,"No"]
[null," ",null," ",null,null,null,null,null,"N/A"]
[]
[null,null,"Assets"]
[null,"SSHP Acct. #","HUD/CHFA Acct. #","Description",null,"Amount"]
[null,1117,1110,"Petty Cash Fund",null,0]
[null,1111,1120,"Cash - Operations",null,0]
[null,null,1121,"Construction Cash Account",null,0]
[null,1113,1123,"Reserve Cash - Saving and Investments",null,0]
[null,null,1125,"Cash - Entity",null,0]
[null,1122,1130,"Tenant Members A/R",null,0]
[null,1123,1130.0999999999999,"Vacated Tenants' A/R",null,0]
{"$rows_left_out":458}
{"sheet":"Stmt of Operations--HM 6-50","index":1,"n_rows":189,"n_cols":10,"rows_kept":189,"cut":false,"hidden":false,"merged":[[73,0,73,7],[156,0,156,7],[189,0,189,7],[155,0,155,7],[74,0,74,7],[137,0,137,7],[132,1,132,7],[4,3,4,7],[145,8,154,12],[0,2,0,4],[142,1,142,5],[143,1,143,5],[144,1,144,5],[6,4,6,7],[8,4,8,7],[10,4,10,7],[141,1,141,5],[5,4,5,7],[7,4,7,7],[9,4,9,7],[11,4,11,7],[0,5,0,7],[1,5,1,7]]}
["STATEMENT OF ",null,null,null,null,{"$f":"'Financial Input Sheet'!F1","v":"Connecticut Housing Finance Authority"},null,null,null,"CHANGES"]
["OPERATIONS ",null,null,null,null,{"$f":"'Financial Input Sheet'!F2","v":"Asset Management - Multifamily Housing"}]
[]
[null,null," "]
["CHFA Form HM 6-50 (Rev. 12/2022 - Effective FYE 12/31/2022)",null,null,"Note:  Insertions, revisions and/or updates have been highlighted in yellow and/or appear in red lettering.  See Changes Column.",null,null,null,null,null,"Updated Rev. and FYE dates"]
[]
["Project Name:",{"$f":"IF(ISBLANK('Financial Input Sheet'!$C$5),\"\",'Financial Input Sheet'!$C$5)","v":""},null,"Fiscal Year-End:",{"$f":"IF(ISBLANK('Financial Input Sheet'!$F$5),\"\",'Financial Input Sheet'!$F$5)","v":""},null,null,null,null,"(Note:  No other changes to this form.)"]
[]
["CHFA Number:",{"$f":"IF(ISBLANK('Financial Input Sheet'!$C$7),\"\",'Financial Input Sheet'!$C$7)","v":""},null,"Beginning Date:",{"$f":"IF(ISBLANK('Financial Input Sheet'!$F$7),\"\",'Financial Input Sheet'!$F$7)","v":""}]
[]
["HUD Number:",{"$f":"IF(ISBLANK('Financial Input Sheet'!$C$9),\"\",'Financial Input Sheet'!$C$9)","v":""},null,"Mortgagor:",{"$f":"IF(ISBLANK('Financial Input Sheet'!$F$9),\"\",'Financial Input Sheet'!$F$9)","v":""}]
[" "," "]
[]
["Part I- P&L","Description of Account","HUD Acct. #","SHP Acct. #",null,"Amount*",null," "]
[null,"Rent Revenue- Gross Potential (Tenant's Portion)",5120,3100,"$",{"$f":"VLOOKUP(C15,'Financial Input Sheet'!$C$14:$H$407,4,FALSE)","v":0}]
[null,"Rental Income-Excess of Base",5120.1000000000004,3100.1,"$",{"$f":"VLOOKUP(C16,'Financial Input Sheet'!$C$14:$H$407,4,FALSE)","v":0}]
[null,"Tenant Assistance Payments (HAP Receipts)",5121,null,"$",{"$f":"VLOOKUP(C17,'Financial Input Sheet'!$C$14:$H$407,4,FALSE)","v":0}]
[null,"Tenant Assistance Payments (RAP Receipts)",5121.1000000000004,2811,"$",{"$f":"VLOOKUP(C18,'Financial Input Sheet'!$C$14:$H$407,4,FALSE)","v":0}]
[null,"Tenant Assistance Payments (ERAP Receipts)",5121.2,null,"$",{"$f":"VLOOKUP(C19,'Financial Input Sheet'!$C$14:$H$407,4,FALSE)","v":0}]
[null,"Tenant Assistance Payments - Congregate",5121.3,null,"$",{"$f":"VLOOKUP(C20,'Financial Input Sheet'!$C$14:$H$407,4,FALSE)","v":0}]
{"$rows_left_out":170}
{"sheet":"Surplus Cash--HM 6-51A","index":2,"n_rows":46,"n_cols":9,"rows_kept":46,"cut":false,"hidden":false,"merged":[[0,4,0,6],[1,4,1,6],[6,3,6,6],[8,3,8,6],[10,3,10,6],[3,2,4,6],[51,0,51,6],[24,1,24,2],[5,3,5,6],[7,3,7,6],[9,3,9,6],[11,3,11,6],[45,1,45,2]]}
["COMPUTATION OF SURPLUS CASH,",null,null,null,{"$f":"'Financial Input Sheet'!F1","v":"Connecticut Housing Finance Authority"},null,null,null,"CHANGES"]
["DISTRIBUTIONS, AND RESIDUAL RECEIPTS",null,null,null,{"$f":"'Financial Input Sheet'!F2","v":"Asset Management - Multifamily Housing"}]
[]
[null,null,"Note:  Insertions, revisions and/or updates have been highlighted in yellow and/or appear in red lettering.  See Changes Column."]
["CHFA Form HM 6-51A (Rev. 12/2022 - Effective FYE 12/31/2022)",null,null,null,null,null,null,null,"Updated Rev. and FYE dates"]
[]
["Project Name:",{"$f":"IF('Financial Input Sheet'!$E$412=\"Surplus Cash - HM 6-51A\",'Financial Input Sheet'!$C$5, \"\")","v":""},"Fiscal Year-End:",{"$f":"IF('Financial Input Sheet'!$E$412=\"Surplus Cash - HM 6-51A\",'Financial Input Sheet'!$F$5, \"\")","v":""}]
[]
["CHFA Number:",{"$f":"IF('Financial Input Sheet'!$E$412=\"Surplus Cash - HM 6-51A\",'Financial Input Sheet'!$C$7, \"\")","v":""},"Beginning Date:",{"$f":"IF('Financial Input Sheet'!$E$412=\"Surplus Cash - HM 6-51A\", 'Financial Input Sheet'!$F$7, \"\")","v":""}]
[]
["HUD Number:",{"$f":"IF('Financial Input Sheet'!$E$412=\"Surplus Cash - HM 6-51A\",'Financial Input Sheet'!$C$9, \"\")","v":""},"Mortgagor:",{"$f":"IF('Financial Input Sheet'!$E$412=\"Surplus Cash - HM 6-51A\",'Financial Input Sheet'!$F$9, \"\")","v":""}]
[" "," "]
[]
["Part A - COMPUTE SURPLUS CASH",null,null,null,null,null," ",null,"Updated the numbering sequence throughout Part A - COMPUTE SURPLUS CASH"]
[null,"1.  Cash (Accounts 1110, 1120, 1191, 1192)",null,"$",{"$f":"IF('Financial Input Sheet'!$E$412=\"Surplus Cash - HM 6-51A\",+'Financial Input Sheet'!F14+'Financial Input Sheet'!F15+'Financial Input Sheet'!F45,\"\")","v":""}]
[null,"2.  Tenant Subsidy vouchers due for period covered by financial statement",null,"$",{"$f":"IF('Financial Input Sheet'!$E$412=\"Surplus Cash - HM 6-51A\", 'Financial Input Sheet'!E416, \"\")","v":""}]
[null,"3. Replacement Reserve withdrawals requested prior to the balance sheet date and approved by CHFA prior to the date of the audit report",null,"$",{"$f":"IF('Financial Input Sheet'!$E$412=\"Surplus Cash - HM 6-51A\", 'Financial Input Sheet'!E417, \"\")","v":""},null,null,null,"Inserted row 17 for input of amount from Financial Input Sheet"]
["CASH","4.  Other (describe)",null,"$",{"$f":"IF('Financial Input Sheet'!$E$412=\"Surplus Cash - HM 6-51A\",'Financial Input Sheet'!E418, \"\")","v":""}]
[null,{"$f":"IF(ISBLANK('Financial Input Sheet'!C419),\"\",'Financial Input Sheet'!C419)","v":""}]
[null,"(A) Total Cash (Add Lines 1, 2, and 3)",null,null,null,"$",{"$f":"SUM(E15:E18)","v":0}]
{"$rows_left_out":27}
{"sheet":"Adjusted Cash Flow--HM 6-51B","index":3,"n_rows":39,"n_cols":9,"rows_kept":39,"cut":false,"hidden":false,"merged":[[44,0,44,6],[15,0,21,0],[35,0,36,0],[9,3,9,6],[10,3,10,6],[11,3,11,6],[15,1,15,2],[37,0,38,0],[32,0,34,0],[22,0,26,0],[16,1,16,2],[17,1,17,2],[28,1,28,2],[38,1,38,2],[8,3,8,6],[0,4,0,6],[1,4,1,6],[5,3,5,6],[6,3,6,6],[7,3,7,6],[4,3,4,6]]}
["COMPUTATION OF ADJUSTED CASH FLOW,",null,null,null,{"$f":"'Financial Input Sheet'!F1","v":"Connecticut Housing Finance Authority"},null,null,null,"CHANGES"]
["DISTRIBUTIONS, AND RESIDUAL RECEIPTS",null,null,null,{"$f":"'Financial Input Sheet'!F2","v":"Asset Management - Multifamily Housing"}]
[{"$f":"IF('Financial Input Sheet'!E412='Financial Input Sheet'!J410,\"FORM NOT REQUIRED - See HM 6-51A\",\" \")","v":" "}]
[]
["CHFA Form HM 6-51B (Rev. 12/2022 - Effective FYE 12/31/2022)  ",null,null,"Note:  Insertions, revisions and/or updates have been highlighted in yellow and/or appear in red lettering.  See Changes Column.",null,null,null,null,"Updated Rev. and FYE dates"]
[]
["Project Name:",{"$f":"IF('Financial Input Sheet'!E412=\"Adjusted Cash Flow - HM 6-51B\",'Financial Input Sheet'!$C$5, \"\")","v":""},"Fiscal Year-End:",{"$f":"IF('Financial Input Sheet'!E412=\"Adjusted Cash Flow - HM 6-51B\", 'Financial Input Sheet'!$F$5, \"\")","v":""}]
[]
["CHFA Number:",{"$f":"IF('Financial Input Sheet'!E412=\"Adjusted Cash Flow - HM 6-51B\",'Financial Input Sheet'!$C$7, \"\")","v":""},"Beginning Date:",{"$f":"IF('Financial Input Sheet'!E412=\"Adjusted Cash Flow - HM 6-51B\",'Financial Input Sheet'!$F$7, \"\")","v":""}]
[]
["HUD Number:",{"$f":"IF('Financial Input Sheet'!E412=\"Adjusted Cash Flow - HM 6-51B\",'Financial Input Sheet'!$C$9, \"\")","v":""},"Mortgagor:",{"$f":"IF('Financial Input Sheet'!E412=\"Adjusted Cash Flow - HM 6-51B\",'Financial Input Sheet'!$F$9, \"\")","v":""}]
[" "," "]
[]
["Part A - COMPUTE ADJUSTED CASH FLOW",null,null,null,null,null," "]
["PROFIT","1. Operating Profit before Depreciation & Amortization (Account 5060T)",null,null,null,"$",{"$f":"IF('Financial Input Sheet'!E412=\"Adjusted Cash Flow - HM 6-51B\",'Financial Input Sheet'!G324, \"\")","v":""},null,"Updated wording to \"Depreciation & Amortization\""]
["ADD","2. Accrued Interest Expense (Included in Account 6820)",null,"$",{"$f":"IF('Financial Input Sheet'!E412=\"Adjusted Cash Flow - HM 6-51B\",'Financial Input Sheet'!F106, \"\")","v":""}]
[null,"3. Imputed Interest Expense/Amortization of Deferred Loan Costs (Included in Account 6820)",null,"$",{"$f":"IF('Financial Input Sheet'!E412=\"Adjusted Cash Flow - HM 6-51B\",+'Financial Input Sheet'!E427, \"\")","v":""},null,null,null,"Updated wording"]
[null,"4. Additional Interest Expense (Included in Account 6820)",null,"$",{"$f":"IF('Financial Input Sheet'!E412=\"Adjusted Cash Flow - HM 6-51B\",'Financial Input Sheet'!E428, \"\")","v":""}]
[null,"5. Interest on Construction and Non-CHFA Mortgages (Accounts 6821, 6825, 6830, 6840)",null,"$",{"$f":"IF('Financial Input Sheet'!E412=\"Adjusted Cash Flow - HM 6-51B\",+'Financial Input Sheet'!F315+'Financial Input Sheet'!F316+'Financial Input Sheet'!F317+'Financial Input Sheet'!F318, \"\")","v":""}]
[null,"6. Other Financial Expenses (Accounts 6850, 6890)",null,"$",{"$f":"IF('Financial Input Sheet'!E412=\"Adjusted Cash Flow - HM 6-51B\",+'Financial Input Sheet'!F319+'Financial Input Sheet'!F320, \"\")","v":""}]
{"$rows_left_out":20}
{"sheet":"Computation of NOI--HM 6-52","index":4,"n_rows":80,"n_cols":15,"rows_kept":80,"cut":false,"hidden":false,"merged":[[7,5,7,11],[5,5,5,11],[6,5,6,12],[8,5,8,12],[0,5,0,12],[1,6,1,12],[3,5,3,12],[60,2,60,4],[47,2,47,4],[48,2,48,4],[49,2,49,4],[59,2,59,4],[46,2,46,4],[24,7,24,11],[26,7,26,11],[22,7,22,11],[16,7,16,11],[82,0,82,12],[9,5,9,11],[68,7,68,11],[14,7,14,11],[18,7,18,11],[20,7,20,11],[39,7,39,11],[61,7,61,11],[51,7,51,11],[78,7,78,11],[79,7,79,11],[73,7,73,11],[74,7,74,11],[76,7,76,11],[75,7,75,11],[77,7,77,11]]}
[null,null,"COMPUTATION OF ",null,null,{"$f":"'Financial Input Sheet'!F1","v":"Connecticut Housing Finance Authority"},null,null,null,null,null,null,null,null,"CHANGES"]
[null,null,"NET OPERATING INCOME",null,null,null,{"$f":"'Financial Input Sheet'!F2","v":"Asset Management - Multifamily Housing"}]
[null,null,null,null," "]
[null,null,"CHFA Form HM 6-52 (Rev. 12/2022 - Effective FYE 12/31/2022)",null,null,"Note:  Insertions, revisions and/or updates have been highlighted in yellow and/or appear in red lettering.  See Changes Column.",null,null,null,null,null,null,null,null,"Updated Rev. and FYE dates"]
[]
[null,null,"Project Name:",{"$f":"IF(ISBLANK('Financial Input Sheet'!$C$5),\"\",'Financial Input Sheet'!$C$5)","v":""},"Fiscal Year-End:",{"$f":"IF(ISBLANK('Financial Input Sheet'!$F$5),\"\",'Financial Input Sheet'!$F$5)","v":""}]
[]
[null,null,"CHFA Number:",{"$f":"IF(ISBLANK('Financial Input Sheet'!$C$7),\"\",'Financial Input Sheet'!$C$7)","v":""},"Beginning Date:",{"$f":"IF(ISBLANK('Financial Input Sheet'!$F$7),\"\",'Financial Input Sheet'!$F$7)","v":""}]
[]
[null,null,"HUD Number:",{"$f":"IF(ISBLANK('Financial Input Sheet'!$C$9),\"\",'Financial Input Sheet'!$C$9)","v":""},"Mortgagor:",{"$f":"IF(ISBLANK('Financial Input Sheet'!$F$9),\"\",'Financial Input Sheet'!$F$9)","v":""}]
[null,null," "," "]
[]
[null,null,"Part I - COMPUTE NET OPERATING INCOME (Source HM 6-50 \"Statement of Operations\")"]
[null,null,null,null,null,null,"Account #"]
[null,null,"A. Profit (Loss) before Depreciation",null,null,null,"5060T",{"$f":"'Stmt of Operations--HM 6-50'!H119","v":0}]
[]
[null,null,"B. Less: Revenue from Investments - Residual Receipts",null,null,null,5430,{"$f":"'Stmt of Operations--HM 6-50'!F40","v":0}]
[]
[null,null,"C. Less: Revenue from Investments - Replacement Reserves",null,null,null,5440,{"$f":"'Stmt of Operations--HM 6-50'!F41","v":0}]
[]
{"$rows_left_out":61}
{"sheet":"DOH Congregate","index":5,"n_rows":52,"n_cols":10,"rows_kept":52,"cut":false,"hidden":false,"merged":[[46,3,46,4],[47,3,47,4],[48,3,48,4],[49,3,49,4],[40,3,40,4],[41,3,41,4],[42,3,42,4],[43,3,43,4],[44,3,44,4],[45,3,45,4],[39,3,39,4],[28,3,28,4],[29,3,29,4],[30,3,30,4],[31,3,31,4],[32,3,32,4],[33,3,33,4],[34,3,34,4],[35,3,35,4],[36,3,36,4],[37,3,37,4],[38,3,38,4],[25,3,25,4],[26,3,26,4],[0,5,0,7],[1,5,1,7],[4,2,4,3],[4,5,4,7],[6,2,6,3],[6,5,6,7],[17,3,17,4],[15,3,15,4],[2,1,2,3],[70,0,70,7],[51,3,51,4],[50,3,50,4],[12,3,12,4],[8,2,8,3],[8,5,8,7],[27,3,27,4],[13,3,13,4],[14,3,14,4],[18,3,18,4],[19,3,19,4],[20,3,20,4],[21,3,21,4],[22,3,22,4],[23,3,23,4],[24,3,24,4]]}
[null,"Computation of Net Congregate Program Cost",null,null,null,"Connecticut Housing Finance Authority",null,null,null,"CHANGES"]
[null,null,null,null,null,"Asset Management - Multifamily Housing"]
[null,"Note:  Insertions, revisions and/or updates have been highlighted in yellow and/or appear in red lettering.  See Changes Column.",null,null,null,null,null,"(Rev. 12/2022 - Effective FYE 12/31/2022)",null,"Updated Rev. and FYE dates"]
[]
[null,"Project Name:",{"$f":"IF(ISBLANK('Financial Input Sheet'!$C$5),\"\",'Financial Input Sheet'!$C$5)","v":""},null,"Fiscal Year-End:",{"$f":"IF(ISBLANK('Financial Input Sheet'!$F$5),\"\",'Financial Input Sheet'!$F$5)","v":""},null,null,null,"(Note:  No other changes to this form.)"]
[]
[null,"CHFA Number:",{"$f":"IF(ISBLANK('Financial Input Sheet'!$C$7),\"\",'Financial Input Sheet'!$C$7)","v":""},null,"Beginning Date:",{"$f":"IF(ISBLANK('Financial Input Sheet'!$F$7),\"\",'Financial Input Sheet'!$F$7)","v":""}]
[]
[null,"HUD Number:",{"$f":"IF(ISBLANK('Financial Input Sheet'!$C$9),\"\",'Financial Input Sheet'!$C$9)","v":""},null,"Mortgagor:",{"$f":"IF(ISBLANK('Financial Input Sheet'!$F$9),\"\",'Financial Input Sheet'!$F$9)","v":""}]
[null," ",null," "]
[]
[]
[null,null,null,"Description",null,"Amount"]
[null,null,7010,"Tenant's Contribution - Congregate Services",null,{"$f":"VLOOKUP(C14,'Financial Input Sheet'!$C$351:$F$387,4,FALSE)","v":0}]
[null,null,7011,"Other Income/Meals",null,{"$f":"VLOOKUP(C15,'Financial Input Sheet'!$C$351:$F$387,4,FALSE)","v":0}]
[null,null,7020,"Tenant's Contribution - Assisted Living Services",null,{"$f":"VLOOKUP(C16,'Financial Input Sheet'!$C$351:$F$387,4,FALSE)","v":0}]
[null,null,7030.1,"State Subsidy - Core",null,{"$f":"VLOOKUP(C17,'Financial Input Sheet'!$C$351:$F$387,4,FALSE)","v":0}]
[null,null,7030.2,"State Subsidy - Expanded Core",null,{"$f":"VLOOKUP(C18,'Financial Input Sheet'!$C$351:$F$387,4,FALSE)","v":0}]
[null,null,7030.3,"State Subsidy - ALSA",null,{"$f":"VLOOKUP(C19,'Financial Input Sheet'!$C$351:$F$387,4,FALSE)","v":0}]
[null,null,7000,"Congregate Income",null,null,{"$f":"SUM(F14:F19)","v":0}]
{"$rows_left_out":32}